Reaction Details
TargetRetinoic acid receptor RXR-alpha
LigandBDBM50123612
Substrate/Competitorn/a
Meas. Tech.ChEMBL_1521819 (CHEMBL3626679)
EC50 23±n/a nM
Citation Atigadda, VRXia, GDeshpande, AWu, LKedishvili, NSmith, CDKrontiras, HBland, KIGrubbs, CJBrouillette, WJMuccio, DD Conformationally Defined Rexinoids and Their Efficacy in the Prevention of Mammary Cancers. J Med Chem58:7763-74 (2015) 
 
Retinoic acid receptor RXR-alpha
Name:Retinoic acid receptor RXR-alpha
Type:PROTEIN
Mol. Mass.:50820.38
Organism:Homo sapiens (Human)
Description:ChEMBL_1456363
Residue:462
BDBM50123612
NameBDBM50123612
Synonyms:CHEMBL3622722
TypeSmall organic molecule
Emp. Form.C23H34O2
Mol. Mass.342.5149
SMILESCCC1=C(CCC(C)C)\C(CCC1)=C\C(\C)=C/C=C/C(/C)=C/C(O)=O