Reaction Details
TargetRetinoic acid receptor RXR-alpha
LigandBDBM50032675
Substrate/Competitorn/a
Meas. Tech.ChEMBL_1521822 (CHEMBL3626682)
EC50 118±n/a nM
Citation Atigadda, VRXia, GDeshpande, AWu, LKedishvili, NSmith, CDKrontiras, HBland, KIGrubbs, CJBrouillette, WJMuccio, DD Conformationally Defined Rexinoids and Their Efficacy in the Prevention of Mammary Cancers. J Med Chem58:7763-74 (2015) 
 
Retinoic acid receptor RXR-alpha
Name:Retinoic acid receptor RXR-alpha
Type:PROTEIN
Mol. Mass.:50820.38
Organism:Homo sapiens (Human)
Description:ChEMBL_1456363
Residue:462
BDBM50032675
NameBDBM50032675
Synonyms:4-[1-(3,5,5,8,8-pentamethyl-5,6,7,8-tetrahydronaphthalen-2-yl)vinyl]benzoic acid CHEMBL1023 | p-(1-(5,6,7,8-Tetrahydro-3,5,5,8,8-pentamethyl-2-naphthyl)vinyl)benzoic acid
TypeSmall organic molecule
Emp. Form.C24H28O2
Mol. Mass.348.4779
SMILESCc1cc2c(cc1C(=C)c1ccc(cc1)C(O)=O)C(C)(C)CCC2(C)C