Reaction Details
TargetRetinoic acid receptor RXR-alpha
LigandBDBM50123610
Substrate/Competitorn/a
Meas. Tech.ChEMBL_1521818 (CHEMBL3626678)
Kd 150±n/a nM
Citation Atigadda, VRXia, GDeshpande, AWu, LKedishvili, NSmith, CDKrontiras, HBland, KIGrubbs, CJBrouillette, WJMuccio, DD Conformationally Defined Rexinoids and Their Efficacy in the Prevention of Mammary Cancers. J Med Chem58:7763-74 (2015) 
 
Retinoic acid receptor RXR-alpha
Name:Retinoic acid receptor RXR-alpha
Type:PROTEIN
Mol. Mass.:50820.38
Organism:Homo sapiens (Human)
Description:ChEMBL_1456363
Residue:462
BDBM50123610
NameBDBM50123610
Synonyms:CHEMBL3622725
TypeSmall organic molecule
Emp. Form.C27H34O2
Mol. Mass.390.5577
SMILESCC(C)CCC1=C(CCC\C1=C/C(/C)=C\C=C\C(\C)=C\C(O)=O)c1ccccc1