Reaction Details
TargetPolyunsaturated fatty acid lipoxygenase ALOX15
LigandBDBM50123798
Substrate/Competitorn/a
Meas. Tech.ChEMBL_1522060 (CHEMBL3627220)
Ki 73±n/a nM
Citation Eleftheriadis, NNeochoritis, CGLeus, NGvan der Wouden, PEDömling, ADekker, FJ Rational Development of a Potent 15-Lipoxygenase-1 Inhibitor with in Vitro and ex Vivo Anti-inflammatory Properties. J Med Chem58:7850-62 (2015) 
 
Polyunsaturated fatty acid lipoxygenase ALOX15
Name:Polyunsaturated fatty acid lipoxygenase ALOX15
Type:Protein
Mol. Mass.:74804.05
Organism:Homo sapiens (Human)
Description:n/a
Residue:662
BDBM50123798
NameBDBM50123798
Synonyms:CHEMBL235920
TypeSmall organic molecule
Emp. Form.C30H36FN5O3S2
Mol. Mass.597.767
SMILESCCN([C@@H]1CCN(C1)C(C)c1ccc(F)cc1)S(=O)(=O)NCCc1nc([nH]c1-c1ccc(OC)cc1)-c1cccs1