Reaction Details
TargetNon-receptor tyrosine-protein kinase TYK2
LigandBDBM50021656
Substrate/Competitorn/a
Meas. Tech.ChEMBL_1520183 (CHEMBL3625892)
IC50 53±n/a nM
Citation Kim, MKShin, HPark, KSKim, HPark, JKim, KNam, JChoo, HChong, Y Benzimidazole Derivatives as Potent JAK1-Selective Inhibitors. J Med Chem58:7596-602 (2015) 
 
Non-receptor tyrosine-protein kinase TYK2
Name:Non-receptor tyrosine-protein kinase TYK2
Type:Protein
Mol. Mass.:133666.03
Organism:Homo sapiens (Human)
Description:P29597
Residue:1187
BDBM50021656
NameBDBM50021656
Synonyms:BARICITINIB LY-3009104 US10766894, Compound TABLE 1.19 US11203595, TABLE 1.19 US20230416237, Example baricitinib
TypeSmall organic molecule
Emp. Form.C16H17N7O2S
Mol. Mass.371.417
SMILESCCS(=O)(=O)N1CC(CC#N)(C1)n1cc(cn1)-c1ncnc2[nH]ccc12