Reaction Details
TargetFatty acid synthase
LigandBDBM50124411
Substrate/Competitorn/a
Meas. Tech.ChEMBL_1520676 (CHEMBL3625457)
IC50 7.9±n/a nM
Citation Mullen, GEYet, L Progress in the development of fatty acid synthase inhibitors as anticancer targets. Bioorg Med Chem Lett25:4363-9 (2015) 
 
Fatty acid synthase
Name:Fatty acid synthase
Type:Enzyme
Mol. Mass.:273419.37
Organism:Homo sapiens (Human)
Description:P49327
Residue:2511
BDBM50124411
NameBDBM50124411
Synonyms:CHEMBL3623458
TypeSmall organic molecule
Emp. Form.C29H28N6O2
Mol. Mass.492.5716
SMILESCn1ncc2c1nc(-c1ccc(cc1)-c1ccc3[nH]ccc3c1)n(C[C@@H]1CCN(C1)C(=O)C1CC1)c2=O