Reaction Details
TargetBeta-galactosidase
LigandBDBM50124581
Substrate/Competitorn/a
Meas. Tech.ChEMBL_1520869 (CHEMBL3626254)
IC50 2300±n/a nM
Citation Pawar, NJParihar, VSKhan, AJoshi, RDhavale, DD Quaternary Indolizidine and Indolizidone Iminosugars as Potential Immunostimulating and Glycosidase Inhibitory Agents: Synthesis, Conformational Analysis, Biological Activity, and Molecular Docking Study. J Med Chem58:7820-32 (2015) 
 
Beta-galactosidase
Name:Beta-galactosidase
Type:Protein
Mol. Mass.:73420.88
Organism:Bos taurus (Bovine)
Description:n/a
Residue:653
BDBM50124581
NameBDBM50124581
Synonyms:CHEMBL3621529 | US20230339856, Compound (IIg)
TypeSmall organic molecule
Emp. Form.C9H17NO4
Mol. Mass.203.2356
SMILESOC[C@@]12CCCN1C[C@H](O)[C@@H](O)[C@@H]2O