Reaction Details
TargetHistone deacetylase 2
LigandBDBM50293360
Substrate/Competitorn/a
Meas. Tech.ChEMBL_1520890 (CHEMBL3626390)
IC50 820±n/a nM
Citation Musso, LCincinelli, RZuco, VZunino, FNurisso, ACuendet, MGiannini, GVesci, LPisano, CDallavalle, S Investigation on the ZBG-functionality of phenyl-4-yl-acrylohydroxamic acid derivatives as histone deacetylase inhibitors. Bioorg Med Chem Lett25:4457-60 (2015) 
 
Histone deacetylase 2
Name:Histone deacetylase 2
Type:Chromatin regulator; hydrolase; repressor
Mol. Mass.:55356.54
Organism:Homo sapiens (Human)
Description:Q92769
Residue:488
BDBM50293360
NameBDBM50293360
Synonyms:CHEMBL556532 | N-Hydroxy-E-3-(biphenyl-4-yl)-acrylamide
TypeSmall organic molecule
Emp. Form.C15H13NO2
Mol. Mass.239.2692
SMILESONC(=O)\C=C\c1ccc(cc1)-c1ccccc1