Reaction Details
TargetcAMP and cAMP-inhibited cGMP 3',5'-cyclic phosphodiesterase 10A
LigandBDBM50124639
Substrate/Competitorn/a
Meas. Tech.ChEMBL_1520899 (CHEMBL3626399)
Ki 18±n/a nM
Citation Shipe, WDSharik, SSBarrow, JCMcGaughey, GBTheberge, CRUslaner, JMYan, YRenger, JJSmith, SMColeman, PJCox, CD Discovery and Optimization of a Series of Pyrimidine-Based Phosphodiesterase 10A (PDE10A) Inhibitors through Fragment Screening, Structure-Based Design, and Parallel Synthesis. J Med Chem58:7888-94 (2015) 
 
cAMP and cAMP-inhibited cGMP 3',5'-cyclic phosphodiesterase 10A
Name:cAMP and cAMP-inhibited cGMP 3',5'-cyclic phosphodiesterase 10A
Type:Protein
Mol. Mass.:88412.52
Organism:Homo sapiens (Human)
Description:Q9Y233
Residue:1055
BDBM50124639
NameBDBM50124639
Synonyms:CHEMBL3622889
TypeSmall organic molecule
Emp. Form.C13H15ClN4S
Mol. Mass.294.803
SMILESCc1nc(CNc2nc(nc(Cl)c2C)C2CC2)cs1