Reaction Details
TargetcAMP and cAMP-inhibited cGMP 3',5'-cyclic phosphodiesterase 10A
LigandBDBM50124698
Substrate/Competitorn/a
Meas. Tech.ChEMBL_1520899 (CHEMBL3626399)
Ki 680±n/a nM
Citation Shipe, WDSharik, SSBarrow, JCMcGaughey, GBTheberge, CRUslaner, JMYan, YRenger, JJSmith, SMColeman, PJCox, CD Discovery and Optimization of a Series of Pyrimidine-Based Phosphodiesterase 10A (PDE10A) Inhibitors through Fragment Screening, Structure-Based Design, and Parallel Synthesis. J Med Chem58:7888-94 (2015) 
 
cAMP and cAMP-inhibited cGMP 3',5'-cyclic phosphodiesterase 10A
Name:cAMP and cAMP-inhibited cGMP 3',5'-cyclic phosphodiesterase 10A
Type:Protein
Mol. Mass.:88412.52
Organism:Homo sapiens (Human)
Description:Q9Y233
Residue:1055
BDBM50124698
NameBDBM50124698
Synonyms:CHEMBL3621549
TypeSmall organic molecule
Emp. Form.C13H14ClN3O
Mol. Mass.263.723
SMILESCc1c(Cl)nc(nc1NCc1ccoc1)C1CC1