Reaction Details
TargetAcetylcholinesterase
LigandBDBM50124882
Substrate/Competitorn/a
Meas. Tech.ChEMBL_1521648 (CHEMBL3626448)
IC50 285±n/a nM
Citation Camerino, EWong, DMTong, FKörber, FGross, ADIslam, RViayna, EMutunga, JMLi, JTotrov, MMBloomquist, JRCarlier, PR Difluoromethyl ketones: Potent inhibitors of wild type and carbamate-insensitive G119S mutant Anopheles gambiae acetylcholinesterase. Bioorg Med Chem Lett25:4405-11 (2015) 
 
Acetylcholinesterase
Name:Acetylcholinesterase
Type:PROTEIN
Mol. Mass.:80902.47
Organism:Anopheles gambiae
Description:ChEMBL_104567
Residue:737
BDBM50124882
NameBDBM50124882
Synonyms:CHEMBL3623548
TypeSmall organic molecule
Emp. Form.C8H9F3N2O
Mol. Mass.206.1651
SMILESCC(C)n1cc(cn1)C(=O)C(F)(F)F