Reaction Details
TargetAcetylcholinesterase
LigandBDBM50124878
Substrate/Competitorn/a
Meas. Tech.ChEMBL_1521648 (CHEMBL3626448)
IC50 1.5±n/a nM
Citation Camerino, EWong, DMTong, FKörber, FGross, ADIslam, RViayna, EMutunga, JMLi, JTotrov, MMBloomquist, JRCarlier, PR Difluoromethyl ketones: Potent inhibitors of wild type and carbamate-insensitive G119S mutant Anopheles gambiae acetylcholinesterase. Bioorg Med Chem Lett25:4405-11 (2015) 
 
Acetylcholinesterase
Name:Acetylcholinesterase
Type:PROTEIN
Mol. Mass.:80902.47
Organism:Anopheles gambiae
Description:ChEMBL_104567
Residue:737
BDBM50124878
NameBDBM50124878
Synonyms:CHEMBL3623552
TypeSmall organic molecule
Emp. Form.C10H11F3N2O
Mol. Mass.232.2023
SMILESFC(F)(F)C(=O)c1cnn(c1)C1CCCC1