Reaction Details
TargetAcetylcholinesterase
LigandBDBM50124875
Substrate/Competitorn/a
Meas. Tech.ChEMBL_1521648 (CHEMBL3626448)
IC50 430±n/a nM
Citation Camerino, EWong, DMTong, FKörber, FGross, ADIslam, RViayna, EMutunga, JMLi, JTotrov, MMBloomquist, JRCarlier, PR Difluoromethyl ketones: Potent inhibitors of wild type and carbamate-insensitive G119S mutant Anopheles gambiae acetylcholinesterase. Bioorg Med Chem Lett25:4405-11 (2015) 
 
Acetylcholinesterase
Name:Acetylcholinesterase
Type:PROTEIN
Mol. Mass.:80902.47
Organism:Anopheles gambiae
Description:ChEMBL_104567
Residue:737
BDBM50124875
NameBDBM50124875
Synonyms:CHEMBL3623555
TypeSmall organic molecule
Emp. Form.C8H10F2N2O
Mol. Mass.188.1746
SMILESCC(C)n1cc(cn1)C(=O)C(F)F