Reaction Details
TargetTrypsin
LigandBDBM50125048
Substrate/Competitorn/a
Meas. Tech.ChEMBL_1522070 (CHEMBL3627230)
Ki 8.0±n/a nM
Citation de Veer, SJWang, CKHarris, JMCraik, DJSwedberg, JE Improving the Selectivity of Engineered Protease Inhibitors: Optimizing the P2 Prime Residue Using a Versatile Cyclic Peptide Library. J Med Chem58:8257-68 (2015) 
 
Trypsin
Name:Trypsin
Synonyms:Serine protease 1/Trypsin-2/Trypsin-3
Type:n/a
Mol. Mass.:n/a
Description:ASSAY_ID of ChEMBL is 2155713
Components:This complex has 3 components.
Component 1
Name:Serine protease 1
Type:Enzyme
Mol. Mass.:26557.80
Organism:Homo sapiens (Human)
Description:P07477
Residue:247
Component 2
Name:Trypsin-2
Synonyms:Anionic trypsinogen Serine protease 2 TRY2_HUMAN Thrombin & trypsin Trypsin II | Trypsin-2
Type:PROTEIN
Mol. Mass.:26479.43
Organism:Homo sapiens (Human)
Description:ChEMBL_41517
Residue:247
Component 3
Name:Trypsin-3
Synonyms:Brain trypsinogen PRSS3 Serine protease 3 TRY3 TRY4 Trypsin Trypsin IV | Trypsin-3
Type:PROTEIN
Mol. Mass.:32532.52
Organism:Homo sapiens (Human)
Description:ChEMBL_216043
Residue:304
BDBM50125048
NameBDBM50125048
Synonyms:CHEMBL3623788
TypeSmall organic molecule
Emp. Form.C55H93N21O15S2
Mol. Mass.1352.589
SMILES[H][C@@]12CCCN1C(=O)[C@]1([H])CCCN1C(=O)[C@@]([H])(NC(=O)[C@H](CO)NC(=O)[C@H](CCCCN)NC(=O)[C@@]([H])(NC(=O)[C@H](CSSC[C@H](NC(=O)[C@H](CCCNC(N)=N)NC2=O)C(=O)N[C@@H](Cc1cnc[nH]1)C(O)=O)NC(=O)[C@H](CCCNC(N)=N)NC(=O)CN)[C@@H](C)O)[C@@H](C)CC