Reaction Details
TargetCarbonic anhydrase 9
LigandBDBM50125364
Substrate/Competitorn/a
Meas. Tech.ChEMBL_1519321 (CHEMBL3624912)
Ki 440±n/a nM
Citation Esirden, IUlus, RAday, BTanç, MSupuran, CTKaya, M Synthesis of novel acridine bis-sulfonamides with effective inhibitory activity against the carbonic anhydrase isoforms I, II, IX and XII. Bioorg Med Chem23:6573-80 (2015) 
 
Carbonic anhydrase 9
Name:Carbonic anhydrase 9
Type:Enzyme
Mol. Mass.:49669.03
Organism:Homo sapiens (Human)
Description:Catalytic domain of human cloned isozyme was used in the assay
Residue:459
BDBM50125364
NameBDBM50125364
Synonyms:CHEMBL3623637
TypeSmall organic molecule
Emp. Form.C36H39N3O7S2
Mol. Mass.689.841
SMILESCOc1ccc(cc1)S(=O)(=O)Nc1ccc(cc1)C1C2=C(CC(C)(C)CC2=O)N(C2=C1C(=O)CC(C)(C)C2)c1ccc(cc1)S(N)(=O)=O