Reaction Details
TargetCarbonic anhydrase 12
LigandBDBM50125370
Substrate/Competitorn/a
Meas. Tech.ChEMBL_1519322 (CHEMBL3624913)
Ki 920±n/a nM
Citation Esirden, IUlus, RAday, BTanç, MSupuran, CTKaya, M Synthesis of novel acridine bis-sulfonamides with effective inhibitory activity against the carbonic anhydrase isoforms I, II, IX and XII. Bioorg Med Chem23:6573-80 (2015) 
 
Carbonic anhydrase 12
Name:Carbonic anhydrase 12
Type:Enzyme
Mol. Mass.:39456.00
Organism:Homo sapiens (Human)
Description:Catalytic domain of human cloned isozyme was used in the assay
Residue:354
BDBM50125370
NameBDBM50125370
Synonyms:CHEMBL3623643
TypeSmall organic molecule
Emp. Form.C36H39N3O7S2
Mol. Mass.689.841
SMILESCOc1ccc(cc1)S(=O)(=O)Nc1cccc(c1)C1C2=C(CC(C)(C)CC2=O)N(C2=C1C(=O)CC(C)(C)C2)c1ccc(cc1)S(N)(=O)=O