Reaction Details
TargetCarbonic anhydrase 2
LigandBDBM50125569
Substrate/Competitorn/a
Meas. Tech.ChEMBL_1519320 (CHEMBL3624911)
Ki 640±n/a nM
Citation Esirden, IUlus, RAday, BTanç, MSupuran, CTKaya, M Synthesis of novel acridine bis-sulfonamides with effective inhibitory activity against the carbonic anhydrase isoforms I, II, IX and XII. Bioorg Med Chem23:6573-80 (2015) 
 
Carbonic anhydrase 2
Name:Carbonic anhydrase 2
Type:Enzyme
Mol. Mass.:29250.71
Organism:Homo sapiens (Human)
Description:P00918
Residue:260
BDBM50125569
NameBDBM50125569
Synonyms:CHEMBL3623631
TypeSmall organic molecule
Emp. Form.C29H31N3O6S
Mol. Mass.549.638
SMILESCC1(C)CC(=O)C2=C(C1)N(C1=C(C2c2ccc(cc2)[N+]([O-])=O)C(=O)CC(C)(C)C1)c1ccc(cc1)S(N)(=O)=O