Reaction Details
TargetCarbonic anhydrase 2
LigandBDBM50125574
Substrate/Competitorn/a
Meas. Tech.ChEMBL_1519320 (CHEMBL3624911)
Ki 960±n/a nM
Citation Esirden, IUlus, RAday, BTanç, MSupuran, CTKaya, M Synthesis of novel acridine bis-sulfonamides with effective inhibitory activity against the carbonic anhydrase isoforms I, II, IX and XII. Bioorg Med Chem23:6573-80 (2015) 
 
Carbonic anhydrase 2
Name:Carbonic anhydrase 2
Type:Enzyme
Mol. Mass.:29250.71
Organism:Homo sapiens (Human)
Description:P00918
Residue:260
BDBM50125574
NameBDBM50125574
Synonyms:CHEMBL3623636
TypeSmall organic molecule
Emp. Form.C36H39N3O6S2
Mol. Mass.673.841
SMILESCc1ccc(cc1)S(=O)(=O)Nc1ccc(cc1)C1C2=C(CC(C)(C)CC2=O)N(C2=C1C(=O)CC(C)(C)C2)c1ccc(cc1)S(N)(=O)=O