Reaction Details
TargetCarbonic anhydrase 9
LigandBDBM50125570
Substrate/Competitorn/a
Meas. Tech.ChEMBL_1519321 (CHEMBL3624912)
Ki 420±n/a nM
Citation Esirden, IUlus, RAday, BTanç, MSupuran, CTKaya, M Synthesis of novel acridine bis-sulfonamides with effective inhibitory activity against the carbonic anhydrase isoforms I, II, IX and XII. Bioorg Med Chem23:6573-80 (2015) 
 
Carbonic anhydrase 9
Name:Carbonic anhydrase 9
Type:Enzyme
Mol. Mass.:49669.03
Organism:Homo sapiens (Human)
Description:Catalytic domain of human cloned isozyme was used in the assay
Residue:459
BDBM50125570
NameBDBM50125570
Synonyms:CHEMBL3623632
TypeSmall organic molecule
Emp. Form.C29H31N3O6S
Mol. Mass.549.638
SMILESCC1(C)CC(=O)C2=C(C1)N(C1=C(C2c2cccc(c2)[N+]([O-])=O)C(=O)CC(C)(C)C1)c1ccc(cc1)S(N)(=O)=O