Reaction Details
TargetCarbonic anhydrase 1
LigandBDBM50125370
Substrate/Competitorn/a
Meas. Tech.ChEMBL_1519319 (CHEMBL3624910)
Ki 4310±n/a nM
Citation Esirden, IUlus, RAday, BTanç, MSupuran, CTKaya, M Synthesis of novel acridine bis-sulfonamides with effective inhibitory activity against the carbonic anhydrase isoforms I, II, IX and XII. Bioorg Med Chem23:6573-80 (2015) 
 
Carbonic anhydrase 1
Name:Carbonic anhydrase 1
Type:Enzyme
Mol. Mass.:28873.37
Organism:Homo sapiens (Human)
Description:P00915
Residue:261
BDBM50125370
NameBDBM50125370
Synonyms:CHEMBL3623643
TypeSmall organic molecule
Emp. Form.C36H39N3O7S2
Mol. Mass.689.841
SMILESCOc1ccc(cc1)S(=O)(=O)Nc1cccc(c1)C1C2=C(CC(C)(C)CC2=O)N(C2=C1C(=O)CC(C)(C)C2)c1ccc(cc1)S(N)(=O)=O