Reaction Details
TargetCarbonic anhydrase 1
LigandBDBM50125367
Substrate/Competitorn/a
Meas. Tech.ChEMBL_1519319 (CHEMBL3624910)
Ki 3890±n/a nM
Citation Esirden, IUlus, RAday, BTanç, MSupuran, CTKaya, M Synthesis of novel acridine bis-sulfonamides with effective inhibitory activity against the carbonic anhydrase isoforms I, II, IX and XII. Bioorg Med Chem23:6573-80 (2015) 
 
Carbonic anhydrase 1
Name:Carbonic anhydrase 1
Type:Enzyme
Mol. Mass.:28873.37
Organism:Homo sapiens (Human)
Description:P00915
Residue:261
BDBM50125367
NameBDBM50125367
Synonyms:CHEMBL3623640
TypeSmall organic molecule
Emp. Form.C39H39N3O6S2
Mol. Mass.709.873
SMILESCC1(C)CC(=O)C2=C(C1)N(C1=C(C2c2ccc(NS(=O)(=O)c3ccc4ccccc4c3)cc2)C(=O)CC(C)(C)C1)c1ccc(cc1)S(N)(=O)=O