Reaction Details
TargetCarbonic anhydrase 1
LigandBDBM50125366
Substrate/Competitorn/a
Meas. Tech.ChEMBL_1519319 (CHEMBL3624910)
Ki 5620±n/a nM
Citation Esirden, IUlus, RAday, BTanç, MSupuran, CTKaya, M Synthesis of novel acridine bis-sulfonamides with effective inhibitory activity against the carbonic anhydrase isoforms I, II, IX and XII. Bioorg Med Chem23:6573-80 (2015) 
 
Carbonic anhydrase 1
Name:Carbonic anhydrase 1
Type:Enzyme
Mol. Mass.:28873.37
Organism:Homo sapiens (Human)
Description:P00915
Residue:261
BDBM50125366
NameBDBM50125366
Synonyms:CHEMBL3623639
TypeSmall organic molecule
Emp. Form.C38H43N3O6S2
Mol. Mass.701.895
SMILESCc1cc(C)c(c(C)c1)S(=O)(=O)Nc1ccc(cc1)C1C2=C(CC(C)(C)CC2=O)N(C2=C1C(=O)CC(C)(C)C2)c1ccc(cc1)S(N)(=O)=O