Reaction Details
TargetCarbonic anhydrase 1
LigandBDBM50125571
Substrate/Competitorn/a
Meas. Tech.ChEMBL_1519319 (CHEMBL3624910)
Ki 2500±n/a nM
Citation Esirden, IUlus, RAday, BTanç, MSupuran, CTKaya, M Synthesis of novel acridine bis-sulfonamides with effective inhibitory activity against the carbonic anhydrase isoforms I, II, IX and XII. Bioorg Med Chem23:6573-80 (2015) 
 
Carbonic anhydrase 1
Name:Carbonic anhydrase 1
Type:Enzyme
Mol. Mass.:28873.37
Organism:Homo sapiens (Human)
Description:P00915
Residue:261
BDBM50125571
NameBDBM50125571
Synonyms:CHEMBL3623633
TypeSmall organic molecule
Emp. Form.C29H33N3O4S
Mol. Mass.519.655
SMILESCC1(C)CC(=O)C2=C(C1)N(C1=C(C2c2ccc(N)cc2)C(=O)CC(C)(C)C1)c1ccc(cc1)S(N)(=O)=O