Reaction Details
TargetCarbonic anhydrase 9
LigandBDBM50125584
Substrate/Competitorn/a
Meas. Tech.ChEMBL_1519336 (CHEMBL3625048)
Ki 25±n/a nM
Citation Nocentini, ACarta, FCeruso, MBartolucci, GSupuran, CT Click-tailed coumarins with potent and selective inhibitory action against the tumor-associated carbonic anhydrases IX and XII. Bioorg Med Chem23:6955-66 (2015) 
 
Carbonic anhydrase 9
Name:Carbonic anhydrase 9
Type:Enzyme
Mol. Mass.:49669.03
Organism:Homo sapiens (Human)
Description:Catalytic domain of human cloned isozyme was used in the assay
Residue:459
BDBM50125584
NameBDBM50125584
Synonyms:CHEMBL3623663
TypeSmall organic molecule
Emp. Form.C18H13N3O3
Mol. Mass.319.3141
SMILESO=c1ccc2ccc(OCc3cn(nn3)-c3ccccc3)cc2o1