Reaction Details
TargetCarbonic anhydrase 9
LigandBDBM50125681
Substrate/Competitorn/a
Meas. Tech.ChEMBL_1519336 (CHEMBL3625048)
Ki 27±n/a nM
Citation Nocentini, ACarta, FCeruso, MBartolucci, GSupuran, CT Click-tailed coumarins with potent and selective inhibitory action against the tumor-associated carbonic anhydrases IX and XII. Bioorg Med Chem23:6955-66 (2015) 
 
Carbonic anhydrase 9
Name:Carbonic anhydrase 9
Type:Enzyme
Mol. Mass.:49669.03
Organism:Homo sapiens (Human)
Description:Catalytic domain of human cloned isozyme was used in the assay
Residue:459
BDBM50125681
NameBDBM50125681
Synonyms:CHEMBL3623670
TypeSmall organic molecule
Emp. Form.C18H13N3O4
Mol. Mass.335.3135
SMILESOc1ccc(cc1)-n1cc(COc2ccc3ccc(=O)oc3c2)nn1