Reaction Details
TargetCarbonic anhydrase 12
LigandBDBM50125685
Substrate/Competitorn/a
Meas. Tech.ChEMBL_1519337 (CHEMBL3625049)
Ki 4.7±n/a nM
Citation Nocentini, ACarta, FCeruso, MBartolucci, GSupuran, CT Click-tailed coumarins with potent and selective inhibitory action against the tumor-associated carbonic anhydrases IX and XII. Bioorg Med Chem23:6955-66 (2015) 
 
Carbonic anhydrase 12
Name:Carbonic anhydrase 12
Type:Enzyme
Mol. Mass.:39456.00
Organism:Homo sapiens (Human)
Description:Catalytic domain of human cloned isozyme was used in the assay
Residue:354
BDBM50125685
NameBDBM50125685
Synonyms:CHEMBL3623668
TypeSmall organic molecule
Emp. Form.C18H12FN3O3
Mol. Mass.337.3046
SMILESFc1ccc(cc1)-n1cc(COc2ccc3ccc(=O)oc3c2)nn1