Reaction Details
TargetC-X-C chemokine receptor type 4
LigandBDBM50125958
Substrate/Competitorn/a
Meas. Tech.ChEMBL_1522943 (CHEMBL3630975)
IC50 2.0±n/a nM
Citation Zhao, HProsser, ARLiotta, DCWilson, LJ Discovery of novel N-aryl piperazine CXCR4 antagonists. Bioorg Med Chem Lett25:4950-5 (2015) 
 
C-X-C chemokine receptor type 4
Name:C-X-C chemokine receptor type 4
Type:Enzyme
Mol. Mass.:39754.61
Organism:Homo sapiens (Human)
Description:P61073
Residue:352
BDBM50125958
NameBDBM50125958
Synonyms:CHEMBL3627862
TypeSmall organic molecule
Emp. Form.C24H34ClN5O2S
Mol. Mass.492.077
SMILESNCCCCN(C[C@H]1CN(CCN1)S(=O)(=O)c1ccc(Cl)cc1)[C@H]1CCCc2cccnc12