Reaction Details
TargetProtein-glutamine gamma-glutamyltransferase 2
LigandBDBM50342590
Substrate/Competitorn/a
Meas. Tech.ChEMBL_1523088 (CHEMBL3631665)
Ki 9100±n/a nM
Citation Yi, MCPalanski, BAQuintero, SAPlugis, NMKhosla, C An unprecedented dual antagonist and agonist of human Transglutaminase 2. Bioorg Med Chem Lett25:4922-6 (2015) 
 
Protein-glutamine gamma-glutamyltransferase 2
Name:Protein-glutamine gamma-glutamyltransferase 2
Type:Protein
Mol. Mass.:77309.30
Organism:Homo sapiens (Human)
Description:P21980
Residue:687
BDBM50342590
NameBDBM50342590
Synonyms:(E)-4-chloro-3-(2-oxo-2-(pyridin-3-yl)ethylidene)-1-phenylindolin-2-one | CHEMBL1770529
TypeSmall organic molecule
Emp. Form.C21H13ClN2O2
Mol. Mass.360.793
SMILESClc1cccc2N(C(=O)\C(=C\C(=O)c3cccnc3)c12)c1ccccc1