Reaction Details
TargetIndoleamine 2,3-dioxygenase 1
LigandBDBM21973
Substrate/Competitorn/a
Meas. Tech.ChEMBL_1523460 (CHEMBL3630804)
Ki 38000±n/a nM
Citation Dounay, ABTuttle, JBVerhoest, PR Challenges and Opportunities in the Discovery of New Therapeutics Targeting the Kynurenine Pathway. J Med Chem58:8762-82 (2015) 
 
Indoleamine 2,3-dioxygenase 1
Name:Indoleamine 2,3-dioxygenase 1
Type:Enzyme
Mol. Mass.:45330.80
Organism:Homo sapiens (Human)
Description:P14902
Residue:403
BDBM21973
NameBDBM21973
Synonyms:1-Methyltryptophan, 1 | 2-amino-3-(1-methyl-1H-indol-3-yl)propanoic acid
TypeSmall organic molecule
Emp. Form.C12H14N2O2
Mol. Mass.218.2518
SMILESCn1cc(CC(N)C(O)=O)c2ccccc12