Reaction Details
TargetIndoleamine 2,3-dioxygenase 1
LigandBDBM50126142
Substrate/Competitorn/a
Meas. Tech.ChEMBL_1523460 (CHEMBL3630804)
IC50 48000±n/a nM
Citation Dounay, ABTuttle, JBVerhoest, PR Challenges and Opportunities in the Discovery of New Therapeutics Targeting the Kynurenine Pathway. J Med Chem58:8762-82 (2015) 
 
Indoleamine 2,3-dioxygenase 1
Name:Indoleamine 2,3-dioxygenase 1
Type:Enzyme
Mol. Mass.:45330.80
Organism:Homo sapiens (Human)
Description:P14902
Residue:403
BDBM50126142
NameBDBM50126142
Synonyms:4-Phenylimidazole US11053207, Compound 5-phenyl-1-imidazole(control)
TypeSmall organic molecule
Emp. Form.C9H8N2
Mol. Mass.144.1732
SMILESc1ncc([nH]1)-c1ccccc1