Reaction Details
TargetIndoleamine 2,3-dioxygenase 1
LigandBDBM24674
Substrate/Competitorn/a
Meas. Tech.ChEMBL_1523460 (CHEMBL3630804)
IC50 365000±n/a nM
Citation Dounay, ABTuttle, JBVerhoest, PR Challenges and Opportunities in the Discovery of New Therapeutics Targeting the Kynurenine Pathway. J Med Chem58:8762-82 (2015) 
 
Indoleamine 2,3-dioxygenase 1
Name:Indoleamine 2,3-dioxygenase 1
Type:Enzyme
Mol. Mass.:45330.80
Organism:Homo sapiens (Human)
Description:P14902
Residue:403
BDBM24674
NameBDBM24674
Synonyms:3-(1H-imidazol-4-yl)phenol | 3-(1H-imidazol-4-yl)phenol, 4
TypeSmall organic molecule
Emp. Form.C9H8N2O
Mol. Mass.160.1726
SMILESOc1cccc(c1)-c1c[nH]cn1