Reaction Details
TargetIndoleamine 2,3-dioxygenase 1
LigandBDBM24667
Substrate/Competitorn/a
Meas. Tech.ChEMBL_1523460 (CHEMBL3630804)
IC50 25000±n/a nM
Citation Dounay, ABTuttle, JBVerhoest, PR Challenges and Opportunities in the Discovery of New Therapeutics Targeting the Kynurenine Pathway. J Med Chem58:8762-82 (2015) 
 
Indoleamine 2,3-dioxygenase 1
Name:Indoleamine 2,3-dioxygenase 1
Type:Enzyme
Mol. Mass.:45330.80
Organism:Homo sapiens (Human)
Description:P14902
Residue:403
BDBM24667
NameBDBM24667
Synonyms:2-(1H-imidazol-4-yl)benzene-1-thiol | 2-(1H-imidazol-4-yl)benzenethiol, 16
TypeSmall organic molecule
Emp. Form.C9H8N2S
Mol. Mass.176.238
SMILESSc1ccccc1-c1c[nH]cn1