Reaction Details
TargetIndoleamine 2,3-dioxygenase 1
LigandBDBM50126143
Substrate/Competitorn/a
Meas. Tech.ChEMBL_1523460 (CHEMBL3630804)
IC50 72±n/a nM
Citation Dounay, ABTuttle, JBVerhoest, PR Challenges and Opportunities in the Discovery of New Therapeutics Targeting the Kynurenine Pathway. J Med Chem58:8762-82 (2015) 
 
Indoleamine 2,3-dioxygenase 1
Name:Indoleamine 2,3-dioxygenase 1
Type:Enzyme
Mol. Mass.:45330.80
Organism:Homo sapiens (Human)
Description:P14902
Residue:403
BDBM50126143
NameBDBM50126143
Synonyms:Epacadostat | INCB-024360
TypeSmall organic molecule
Emp. Form.C11H13BrFN7O4S
Mol. Mass.438.233
SMILESNS(=O)(=O)NCCNc1nonc1\C(Nc1ccc(F)c(Br)c1)=N\O