Reaction Details
TargetTryptophan 2,3-dioxygenase
LigandBDBM50126145
Substrate/Competitorn/a
Meas. Tech.ChEMBL_1523461 (CHEMBL3630805)
IC50<1000±n/a nM
Citation Dounay, ABTuttle, JBVerhoest, PR Challenges and Opportunities in the Discovery of New Therapeutics Targeting the Kynurenine Pathway. J Med Chem58:8762-82 (2015) 
 
Tryptophan 2,3-dioxygenase
Name:Tryptophan 2,3-dioxygenase
Type:PROTEIN
Mol. Mass.:47874.48
Organism:Homo sapiens (Human)
Description:ChEMBL_825691
Residue:406
BDBM50126145
NameBDBM50126145
Synonyms:CHEMBL3629570
TypeSmall organic molecule
Emp. Form.C18H20N2O
Mol. Mass.280.3642
SMILESO=C(CC1c2ccccc2-c2cncn12)C1CCCCC1