Reaction Details
TargetTryptophan 2,3-dioxygenase
LigandBDBM50030791
Substrate/Competitorn/a
Meas. Tech.ChEMBL_1523461 (CHEMBL3630805)
IC50>62500±n/a nM
Citation Dounay, ABTuttle, JBVerhoest, PR Challenges and Opportunities in the Discovery of New Therapeutics Targeting the Kynurenine Pathway. J Med Chem58:8762-82 (2015) 
 
Tryptophan 2,3-dioxygenase
Name:Tryptophan 2,3-dioxygenase
Type:PROTEIN
Mol. Mass.:47874.48
Organism:Homo sapiens (Human)
Description:ChEMBL_825691
Residue:406
BDBM50030791
NameBDBM50030791
Synonyms:CHEMBL3342402
TypeSmall organic molecule
Emp. Form.C20H16N4O3S2
Mol. Mass.424.496
SMILESCc1ccc(cc1)-c1csc2nnc(SCC(=O)Nc3ccc4OCOc4c3)n12