Reaction Details
TargetIndoleamine 2,3-dioxygenase 2
LigandBDBM50030791
Substrate/Competitorn/a
Meas. Tech.ChEMBL_1523462 (CHEMBL3630806)
IC50>250000±n/a nM
Citation Dounay, ABTuttle, JBVerhoest, PR Challenges and Opportunities in the Discovery of New Therapeutics Targeting the Kynurenine Pathway. J Med Chem58:8762-82 (2015) 
 
Indoleamine 2,3-dioxygenase 2
Name:Indoleamine 2,3-dioxygenase 2
Type:PROTEIN
Mol. Mass.:47079.13
Organism:Homo sapiens (Human)
Description:ChEMBL_109909
Residue:420
BDBM50030791
NameBDBM50030791
Synonyms:CHEMBL3342402
TypeSmall organic molecule
Emp. Form.C20H16N4O3S2
Mol. Mass.424.496
SMILESCc1ccc(cc1)-c1csc2nnc(SCC(=O)Nc3ccc4OCOc4c3)n12