Reaction Details
TargetTryptophan 2,3-dioxygenase
LigandBDBM50350248
Substrate/Competitorn/a
Meas. Tech.ChEMBL_1523463 (CHEMBL3630807)
IC50 620±n/a nM
Citation Dounay, ABTuttle, JBVerhoest, PR Challenges and Opportunities in the Discovery of New Therapeutics Targeting the Kynurenine Pathway. J Med Chem58:8762-82 (2015) 
 
Tryptophan 2,3-dioxygenase
Name:Tryptophan 2,3-dioxygenase
Type:PROTEIN
Mol. Mass.:47874.48
Organism:Homo sapiens (Human)
Description:ChEMBL_825691
Residue:406
BDBM50350248
NameBDBM50350248
Synonyms:CHEMBL1812545
TypeSmall organic molecule
Emp. Form.C11H8FN5
Mol. Mass.229.2131
SMILESFc1ccc2c(C=Cc3nnn[nH]3)c[nH]c2c1