Reaction Details
TargetIndoleamine 2,3-dioxygenase 1
LigandBDBM50289137
Substrate/Competitorn/a
Meas. Tech.ChEMBL_1523465 (CHEMBL3630809)
IC50>80000±n/a nM
Citation Dounay, ABTuttle, JBVerhoest, PR Challenges and Opportunities in the Discovery of New Therapeutics Targeting the Kynurenine Pathway. J Med Chem58:8762-82 (2015) 
 
Indoleamine 2,3-dioxygenase 1
Name:Indoleamine 2,3-dioxygenase 1
Type:PROTEIN
Mol. Mass.:45639.39
Organism:Mus musculus
Description:ChEMBL_1452149
Residue:407
BDBM50289137
NameBDBM50289137
Synonyms:6-Fluoro-3-((E)-2-pyridin-3-yl-vinyl)-1H-indole US10155972, Compound 680C91
TypeSmall organic molecule
Emp. Form.C15H11FN2
Mol. Mass.238.2596
SMILESFc1ccc2c(\C=C\c3cccnc3)c[nH]c2c1