Reaction Details
TargetIndoleamine 2,3-dioxygenase 1
LigandBDBM50350248
Substrate/Competitorn/a
Meas. Tech.ChEMBL_1523465 (CHEMBL3630809)
IC50>400000±n/a nM
Citation Dounay, ABTuttle, JBVerhoest, PR Challenges and Opportunities in the Discovery of New Therapeutics Targeting the Kynurenine Pathway. J Med Chem58:8762-82 (2015) 
 
Indoleamine 2,3-dioxygenase 1
Name:Indoleamine 2,3-dioxygenase 1
Type:PROTEIN
Mol. Mass.:45639.39
Organism:Mus musculus
Description:ChEMBL_1452149
Residue:407
BDBM50350248
NameBDBM50350248
Synonyms:CHEMBL1812545
TypeSmall organic molecule
Emp. Form.C11H8FN5
Mol. Mass.229.2131
SMILESFc1ccc2c(C=Cc3nnn[nH]3)c[nH]c2c1