Reaction Details
TargetKynurenine 3-monooxygenase
LigandBDBM50061907
Substrate/Competitorn/a
Meas. Tech.ChEMBL_1523466 (CHEMBL3630810)
IC50 900±n/a nM
Citation Dounay, ABTuttle, JBVerhoest, PR Challenges and Opportunities in the Discovery of New Therapeutics Targeting the Kynurenine Pathway. J Med Chem58:8762-82 (2015) 
 
Kynurenine 3-monooxygenase
Name:Kynurenine 3-monooxygenase
Type:PROTEIN
Mol. Mass.:55831.03
Organism:Homo sapiens (Human)
Description:ChEMBL_1487479
Residue:486
BDBM50061907
NameBDBM50061907
Synonyms:(+/-)-2-Amino-4-(3-nitro-phenyl)-4-oxo-butyric acid[(+/-)-m-nicotinylbenzoylalanine] CHEMBL23983 | meta-nitrobenzoyl)alanine
TypeSmall organic molecule
Emp. Form.C10H10N2O5
Mol. Mass.238.1968
SMILESNC(CC(=O)c1cccc(c1)[N+]([O-])=O)C(O)=O