Reaction Details
TargetKynurenine 3-monooxygenase
LigandBDBM50126147
Substrate/Competitorn/a
Meas. Tech.ChEMBL_1523467 (CHEMBL3630811)
IC50 74±n/a nM
Citation Dounay, ABTuttle, JBVerhoest, PR Challenges and Opportunities in the Discovery of New Therapeutics Targeting the Kynurenine Pathway. J Med Chem58:8762-82 (2015) 
 
Kynurenine 3-monooxygenase
Name:Kynurenine 3-monooxygenase
Type:n/a
Mol. Mass.:52440.50
Organism:Saccharomyces cerevisiae (strain ATCC 204508 / S288c) (Baker's yeast)
Description:n/a
Residue:460
BDBM50126147
NameBDBM50126147
Synonyms:CHEMBL3629571
TypeSmall organic molecule
Emp. Form.C11H8Cl2O3
Mol. Mass.259.085
SMILESOC(=O)C1CC1C(=O)c1ccc(Cl)c(Cl)c1