Reaction Details
TargetReduced folate transporter
LigandBDBM50126174
Substrate/Competitorn/a
Meas. Tech.ChEMBL_1523799 (CHEMBL3632250)
IC50 189±n/a nM
Citation Wang, LWallace, ARaghavan, SDeis, SMWilson, MRYang, SPolin, LWhite, KKushner, JOrr, SGeorge, CO'Connor, CHou, ZMitchell-Ryan, SDann, CEMatherly, LHGangjee, A 6-Substituted Pyrrolo[2,3-d]pyrimidine Thienoyl Regioisomers as Targeted Antifolates for Folate Receptora and the Proton-Coupled Folate Transporter in Human Tumors. J Med Chem58:6938-59 (2015) 
 
Reduced folate transporter
Name:Reduced folate transporter
Type:PROTEIN
Mol. Mass.:64885.16
Organism:Homo sapiens (Human)
Description:ChEMBL_1469594
Residue:591
BDBM50126174
NameBDBM50126174
Synonyms:CHEMBL3628346
TypeSmall organic molecule
Emp. Form.C19H21N5O6S
Mol. Mass.447.465
SMILESNc1nc2[nH]c(CCCc3cc(cs3)C(=O)N[C@@H](CCC(O)=O)C(O)=O)cc2c(=O)[nH]1