Reaction Details
TargetTrifunctional purine biosynthetic protein adenosine-3
LigandBDBM50126172
Substrate/Competitorn/a
Meas. Tech.ChEMBL_1523832 (CHEMBL3632393)
IC50 2.4±n/a nM
Citation Wang, LWallace, ARaghavan, SDeis, SMWilson, MRYang, SPolin, LWhite, KKushner, JOrr, SGeorge, CO'Connor, CHou, ZMitchell-Ryan, SDann, CEMatherly, LHGangjee, A 6-Substituted Pyrrolo[2,3-d]pyrimidine Thienoyl Regioisomers as Targeted Antifolates for Folate Receptora and the Proton-Coupled Folate Transporter in Human Tumors. J Med Chem58:6938-59 (2015) 
 
Trifunctional purine biosynthetic protein adenosine-3
Name:Trifunctional purine biosynthetic protein adenosine-3
Type:Protein
Mol. Mass.:107768.47
Organism:Homo sapiens (Human)
Description:P22102
Residue:1010
BDBM50126172
NameBDBM50126172
Synonyms:CHEMBL3628344
TypeSmall organic molecule
Emp. Form.C19H21N5O6S
Mol. Mass.447.465
SMILESNc1nc2[nH]c(CCCc3csc(c3)C(=O)N[C@@H](CCC(O)=O)C(O)=O)cc2c(=O)[nH]1