Reaction Details
Target17-beta-hydroxysteroid dehydrogenase type 2
LigandBDBM50126967
Substrate/Competitorn/a
Meas. Tech.ChEMBL_1524156 (CHEMBL3631241)
IC50 99±n/a nM
Citation Abdelsamie, ASBey, EGargano, EMvan Koppen, CJEmpting, MFrotscher, M Towards the evaluation in an animal disease model: Fluorinated 17ß-HSD1 inhibitors showing strong activity towards both the human and the rat enzyme. Eur J Med Chem103:56-68 (2015) 
 
17-beta-hydroxysteroid dehydrogenase type 2
Name:17-beta-hydroxysteroid dehydrogenase type 2
Type:Oxidoreductase; single-pass type II membrane protein
Mol. Mass.:42795.29
Organism:Homo sapiens (Human)
Description:Enzyme was partially purified from human placenta.
Residue:387
BDBM50126967
NameBDBM50126967
Synonyms:CHEMBL3629581
TypeSmall organic molecule
Emp. Form.C24H19NO4S2
Mol. Mass.449.542
SMILESCc1cccc(c1)S(=O)(=O)Nc1cccc(c1)-c1ccc(s1)C(=O)c1cccc(O)c1