Reaction Details
Target17-beta-hydroxysteroid dehydrogenase type 2
LigandBDBM50126976
Substrate/Competitorn/a
Meas. Tech.ChEMBL_1524156 (CHEMBL3631241)
IC50 6.5±n/a nM
Citation Abdelsamie, ASBey, EGargano, EMvan Koppen, CJEmpting, MFrotscher, M Towards the evaluation in an animal disease model: Fluorinated 17ß-HSD1 inhibitors showing strong activity towards both the human and the rat enzyme. Eur J Med Chem103:56-68 (2015) 
 
17-beta-hydroxysteroid dehydrogenase type 2
Name:17-beta-hydroxysteroid dehydrogenase type 2
Type:Oxidoreductase; single-pass type II membrane protein
Mol. Mass.:42795.29
Organism:Homo sapiens (Human)
Description:Enzyme was partially purified from human placenta.
Residue:387
BDBM50126976
NameBDBM50126976
Synonyms:CHEMBL3629590
TypeSmall organic molecule
Emp. Form.C20H15F2NO4S2
Mol. Mass.435.464
SMILESOc1ccc(F)c(C(=O)c2ccc(s2)-c2cccc(NS(=O)(=O)C3CC3)c2)c1F