Reaction Details
Target17-beta-hydroxysteroid dehydrogenase type 1
LigandBDBM50127001
Substrate/Competitorn/a
Meas. Tech.ChEMBL_1524155 (CHEMBL3631240)
IC50 38±n/a nM
Citation Abdelsamie, ASBey, EGargano, EMvan Koppen, CJEmpting, MFrotscher, M Towards the evaluation in an animal disease model: Fluorinated 17ß-HSD1 inhibitors showing strong activity towards both the human and the rat enzyme. Eur J Med Chem103:56-68 (2015) 
 
17-beta-hydroxysteroid dehydrogenase type 1
Name:17-beta-hydroxysteroid dehydrogenase type 1
Type:Enzyme
Mol. Mass.:34945.13
Organism:Homo sapiens (Human)
Description:P14061
Residue:328
BDBM50127001
NameBDBM50127001
Synonyms:CHEMBL3629594
TypeSmall organic molecule
Emp. Form.C18H11F3O3S
Mol. Mass.364.338
SMILESOc1cccc(c1)-c1ccc(s1)C(=O)c1ccc(c(O)c1)C(F)(F)F