Reaction Details
TargetMitogen-activated protein kinase 1
LigandBDBM50127038
Substrate/Competitorn/a
Meas. Tech.ChEMBL_1524688 (CHEMBL3631082)
IC50 280±n/a nM
Citation Burdick, DJWang, SHeise, CPan, BDrummond, JYin, JGoeser, LMagnuson, SBlaney, JMoffat, JWang, WChen, H Fragment-based discovery of potent ERK2 pyrrolopyrazine inhibitors. Bioorg Med Chem Lett25:4728-32 (2015) 
 
Mitogen-activated protein kinase 1
Name:Mitogen-activated protein kinase 1
Type:Ser/Thr Protein Kinase
Mol. Mass.:41392.76
Organism:Homo sapiens (Human)
Description:P28482
Residue:360
BDBM50127038
NameBDBM50127038
Synonyms:CHEMBL3628368
TypeSmall organic molecule
Emp. Form.C14H10N6
Mol. Mass.262.2694
SMILESc1n[nH]cc1-c1cnc2[nH]cc(-c3cccnc3)c2n1