Reaction Details
TargetMitogen-activated protein kinase 1
LigandBDBM50127083
Substrate/Competitorn/a
Meas. Tech.ChEMBL_1524688 (CHEMBL3631082)
IC50 468±n/a nM
Citation Burdick, DJWang, SHeise, CPan, BDrummond, JYin, JGoeser, LMagnuson, SBlaney, JMoffat, JWang, WChen, H Fragment-based discovery of potent ERK2 pyrrolopyrazine inhibitors. Bioorg Med Chem Lett25:4728-32 (2015) 
 
Mitogen-activated protein kinase 1
Name:Mitogen-activated protein kinase 1
Type:Ser/Thr Protein Kinase
Mol. Mass.:41392.76
Organism:Homo sapiens (Human)
Description:P28482
Residue:360
BDBM50127083
NameBDBM50127083
Synonyms:CHEMBL3628371
TypeSmall organic molecule
Emp. Form.C16H12N6
Mol. Mass.288.3067
SMILESNc1ccc(cn1)-c1c[nH]c2ncc(nc12)-c1ccncc1