Reaction Details
TargetMitogen-activated protein kinase 1
LigandBDBM50127095
Substrate/Competitorn/a
Meas. Tech.ChEMBL_1524689 (CHEMBL3631083)
IC50 72±n/a nM
Citation Burdick, DJWang, SHeise, CPan, BDrummond, JYin, JGoeser, LMagnuson, SBlaney, JMoffat, JWang, WChen, H Fragment-based discovery of potent ERK2 pyrrolopyrazine inhibitors. Bioorg Med Chem Lett25:4728-32 (2015) 
 
Mitogen-activated protein kinase 1
Name:Mitogen-activated protein kinase 1
Type:Ser/Thr Protein Kinase
Mol. Mass.:41392.76
Organism:Homo sapiens (Human)
Description:P28482
Residue:360
BDBM50127095
NameBDBM50127095
Synonyms:CHEMBL3628376
TypeSmall organic molecule
Emp. Form.C15H12N6
Mol. Mass.276.296
SMILESCn1cc(cn1)-c1c[nH]c2ncc(nc12)-c1ccncc1