Reaction Details
TargetDelta-type opioid receptor
LigandBDBM50127700
Substrate/Competitorn/a
Meas. Tech.ChEMBL_1522817 (CHEMBL3630376)
Ki 12050±n/a nM
Citation Liu, XZhao, LWang, YMou, LYang, JZhang, YWang, DWang, R Design, synthesis, and evaluation of new endomorphin analogs with enhanced central antinociception after peripheral administration. Bioorg Med Chem Lett25:5393-7 (2015) 
 
Delta-type opioid receptor
Name:Delta-type opioid receptor
Type:G Protein-Coupled Receptor (GPCR)
Mol. Mass.:40382.98
Organism:Homo sapiens (Human)
Description:Competition binding assays were carried out using membrane preparations from transfected HN9.10 cells that constitutively expressed the delta opioid receptor.
Residue:372
BDBM50127700
NameBDBM50127700
Synonyms:CHEMBL3629337
TypeSmall organic molecule
Emp. Form.C33H36N6O5S
Mol. Mass.628.741
SMILESN[C@@H](Cc1ccc(O)cc1)C(=O)N1CCC[C@H]1C(=O)N[C@@H](Cc1c[nH]c2ccccc12)C(=O)N[C@@H](C(=C)C(N)=O)c1cccs1